Target
Cannabinoid receptor 1
Ligand
BDBM50128100
Substrate
Meas. Tech.
ChEMBL_46450 (CHEMBL657898)
Ki
245±n/a nM
Citation
 Wrobleski, STChen, PHynes, JLin, SNorris, DJPandit, CRSpergel, SWu, HTokarski, JSChen, XGillooly, KMKiener, PAMcIntyre, KWPatil-Koota, VShuster, DJTurk, LAYang, GLeftheris, K Rational design and synthesis of an orally active indolopyridone as a novel conformationally constrained cannabinoid ligand possessing antiinflammatory properties. J Med Chem 46:2110-6 (2003)  
Target
Name:
Cannabinoid receptor 1
Synonyms:
CANN6 CB-R CNR CNR1_HUMAN Cannabinoid receptor Cannabinoid receptor 1 (brain)
Type:
G Protein-Coupled Receptor (GPCR)
Mol. Mass.:
52868.96
Organism:
Homo sapiens (Human)
Description:
P21554
Residue:
472
  
Inhibitor
Name:
BDBM50128100
Synonyms:
7-Methoxy-1-(2-morpholin-4-yl-ethyl)-1H-indole-3-carboxylic acid (1,3,3-trimethyl-bicyclo[2.2.1]hept-2-yl)-amide | CHEMBL68288
Type:
Small organic molecule
Emp. Form.:
C26H37N3O3
Mol. Mass.:
439.5903
SMILES:
COc1cccc2c(cn(CCN3CCOCC3)c12)C(=O)NC1[C@@]2(C)CC[C@H](C2)C1(C)C
: