Target
Cannabinoid receptor 1
Ligand
BDBM50128093
Substrate
Meas. Tech.
ChEMBL_46450 (CHEMBL657898)
Ki
162±n/a nM
Citation
 Wrobleski, STChen, PHynes, JLin, SNorris, DJPandit, CRSpergel, SWu, HTokarski, JSChen, XGillooly, KMKiener, PAMcIntyre, KWPatil-Koota, VShuster, DJTurk, LAYang, GLeftheris, K Rational design and synthesis of an orally active indolopyridone as a novel conformationally constrained cannabinoid ligand possessing antiinflammatory properties. J Med Chem 46:2110-6 (2003)  
Target
Name:
Cannabinoid receptor 1
Synonyms:
CANN6 CB-R CNR CNR1_HUMAN Cannabinoid receptor Cannabinoid receptor 1 (brain)
Type:
G Protein-Coupled Receptor (GPCR)
Mol. Mass.:
52868.96
Organism:
Homo sapiens (Human)
Description:
P21554
Residue:
472
  
Inhibitor
Name:
BDBM50128093
Synonyms:
7-Methoxy-1-(2-morpholin-4-yl-ethyl)-1H-indazole-3-carboxylic acid (phenyl-pyridin-2-yl-methyl)-amide | CHEMBL66956
Type:
Small organic molecule
Emp. Form.:
C27H29N5O3
Mol. Mass.:
471.5509
SMILES:
COc1cccc2c(nn(CCN3CCOCC3)c12)C(=O)NC(c1ccccc1)c1ccccn1
: