Target
Cannabinoid receptor 2
Ligand
BDBM50272598
Substrate
Meas. Tech.
ChEMBL_46981 (CHEMBL659748)
Ki
1±n/a nM
Citation
 Wrobleski, STChen, PHynes, JLin, SNorris, DJPandit, CRSpergel, SWu, HTokarski, JSChen, XGillooly, KMKiener, PAMcIntyre, KWPatil-Koota, VShuster, DJTurk, LAYang, GLeftheris, K Rational design and synthesis of an orally active indolopyridone as a novel conformationally constrained cannabinoid ligand possessing antiinflammatory properties. J Med Chem 46:2110-6 (2003)  
Target
Name:
Cannabinoid receptor 2
Synonyms:
CANNABINOID CB2 CB2 CB2B CNR2_HUMAN Cannabinoid CB2 receptor Cannabinoid receptor 2 (CB2R) | hCB2
Type:
G Protein-Coupled Receptor (GPCR)
Mol. Mass.:
39690.94
Organism:
Homo sapiens (Human)
Description:
P34972
Residue:
360
  
Inhibitor
Name:
BDBM50272598
Synonyms:
6-Methoxy-5-(2-morpholin-4-yl-ethyl)-2-(1,3,3-trimethyl-bicyclo[2.2.1]hept-2-yl)-2,5-dihydro-pyrido[4,3-b]indol-1-one CHEMBL527031
Type:
Small organic molecule
Emp. Form.:
C28H37N3O3
Mol. Mass.:
463.6117
SMILES:
COc1cccc2c1n(CCN1CCOCC1)c1ccn([C@H]3[C@@]4(C)CC[C@H](C4)C3(C)C)c(=O)c21
: