Target
Cannabinoid receptor 2
Ligand
BDBM50128094
Substrate
Meas. Tech.
ChEMBL_46981 (CHEMBL659748)
Ki
67±n/a nM
Citation
 Wrobleski, STChen, PHynes, JLin, SNorris, DJPandit, CRSpergel, SWu, HTokarski, JSChen, XGillooly, KMKiener, PAMcIntyre, KWPatil-Koota, VShuster, DJTurk, LAYang, GLeftheris, K Rational design and synthesis of an orally active indolopyridone as a novel conformationally constrained cannabinoid ligand possessing antiinflammatory properties. J Med Chem 46:2110-6 (2003)  
Target
Name:
Cannabinoid receptor 2
Synonyms:
CANNABINOID CB2 CB2 CB2B CNR2_HUMAN Cannabinoid CB2 receptor Cannabinoid receptor 2 (CB2R) | hCB2
Type:
G Protein-Coupled Receptor (GPCR)
Mol. Mass.:
39690.94
Organism:
Homo sapiens (Human)
Description:
P34972
Residue:
360
  
Inhibitor
Name:
BDBM50128094
Synonyms:
6-Methoxy-2-(2-methoxy-benzyl)-5-(2-morpholin-4-yl-ethyl)-2,5-dihydro-pyrido[4,3-b]indol-1-one | CHEMBL63561
Type:
Small organic molecule
Emp. Form.:
C26H29N3O4
Mol. Mass.:
447.5262
SMILES:
COc1ccccc1Cn1ccc2n(CCN3CCOCC3)c3c(OC)cccc3c2c1=O
: