Target
Proto-oncogene tyrosine-protein kinase Src
Ligand
BDBM50148012
Substrate
Meas. Tech.
ChEMBL_217006 (CHEMBL821541)
IC50
25700±n/a nM
Citation
 Nam, NHYe, GSun, GParang, K Conformationally constrained peptide analogues of pTyr-Glu-Glu-Ile as inhibitors of the Src SH2 domain binding. J Med Chem 47:3131-41 (2004)  
Target
Name:
Proto-oncogene tyrosine-protein kinase Src
Synonyms:
Calmodulin/Proto-oncogene tyrosine-protein kinase Src Proto-oncogene c-Src SRC SRC_HUMAN V-src sarcoma (Schmidt-Ruppin A-2) viral oncogene homolog (avian) p60-Src | pp60c-src
Type:
Protein
Mol. Mass.:
59838.60
Organism:
Homo sapiens (Human)
Description:
P12931
Residue:
536
  
Inhibitor
Name:
BDBM50148012
Synonyms:
(S)-2-(3-{(S)-2-[2-((S)-Acetylamino)-3-(4-phosphonooxy-phenyl)-propionylamino]-4-carboxy-butyrylamino}-4-carboxy-butyrylamino)-3-methyl-butyric acid | CHEMBL106840
Type:
Small organic molecule
Emp. Form.:
C26H37N4O14P
Mol. Mass.:
660.5641
SMILES:
CC(C)[C@H](NC(=O)C[C@@H](CC(O)=O)NC(=O)[C@H](CCC(O)=O)NC(=O)[C@H](Cc1ccc(OP(O)(O)=O)cc1)NC(C)=O)C(O)=O
: