Target
Histone deacetylase 1
Ligand
BDBM50153765
Substrate
Meas. Tech.
ChEMBL_304811 (CHEMBL827901)
IC50
850±n/a nM
Citation
 Jose, BOniki, YKato, TNishino, NSumida, YYoshida, M Novel histone deacetylase inhibitors: cyclic tetrapeptide with trifluoromethyl and pentafluoroethyl ketones. Bioorg Med Chem Lett 14:5343-6 (2004)  
Target
Name:
Histone deacetylase 1
Synonyms:
Cereblon/Histone deacetylase 1 HDAC1 Histone deacetylase 1 (HDAC1) RPD3L1
Type:
Enzyme
Mol. Mass.:
55090.27
Organism:
Homo sapiens (Human)
Description:
Q13547
Residue:
482
  
Inhibitor
Name:
BDBM50153765
Synonyms:
(5S,8R,11S,13aR)-5-sec-Butyl-8-(4-methoxy-benzyl)-11-(7,7,8,8,8-pentafluoro-6-oxo-octyl)-decahydro-3a,6,9,12-tetraaza-cyclopentacyclododecene-4,7,10,13-tetraone | CHEMBL363528
Type:
Small organic molecule
Emp. Form.:
C31H41F5N4O6
Mol. Mass.:
660.6725
SMILES:
CCC(C)[C@@H]1NC(=O)[C@@H](Cc2ccc(OC)cc2)NC(=O)[C@H](CCCCCC(=O)C(F)(F)C(F)(F)F)NC(=O)[C@H]2CCCN2C1=O
: