Target
Cannabinoid receptor 1
Ligand
BDBM50172545
Substrate
Meas. Tech.
ChEMBL_320880 (CHEMBL884805)
Ki
0.2±n/a nM
Citation
 Deng, HGifford, ANZvonok, AMCui, GLi, XFan, PDeschamps, JRFlippen-Anderson, JLGatley, SJMakriyannis, A Potent cannabinergic indole analogues as radioiodinatable brain imaging agents for the CB1 cannabinoid receptor. J Med Chem 48:6386-92 (2005)  
Target
Name:
Cannabinoid receptor 1
Synonyms:
Brain-type cannabinoid receptor CB-R CNR1_MOUSE Cannabinoid receptor | Cnr1
Type:
Enzyme
Mol. Mass.:
52842.52
Organism:
Mus musculus (Mouse)
Description:
P47746
Residue:
473
  
Inhibitor
Name:
BDBM50172545
Synonyms:
(2-Iodo-phenyl)-[1-((S)-1-methyl-piperidin-2-ylmethyl)-1H-indol-3-yl]-methanone CHEMBL364266
Type:
Small organic molecule
Emp. Form.:
C22H23IN2O
Mol. Mass.:
458.3353
SMILES:
CN1CCCCC1Cn1cc(C(=O)c2ccccc2I)c2ccccc12
: