Target
UDP-glucuronosyltransferase 2B7
Ligand
BDBM50370965
Substrate
Meas. Tech.
ChEMBL_436438 (CHEMBL904746)
IC50
5000±n/a nM
Citation
 Bichlmaier, IKurkela, MJoshi, TSiiskonen, ARüffer, TLang, HSuchanova, BVahermo, MFinel, MYli-Kauhaluoma, J Isoform-selective inhibition of the human UDP-glucuronosyltransferase 2B7 by isolongifolol derivatives. J Med Chem 50:2655-64 (2007)  
Target
Name:
UDP-glucuronosyltransferase 2B7
Synonyms:
2.4.1.17 UD2B7_HUMAN UDP-glucuronosyltransferase 2B9 UDPGT 2B9 UGT2B7 Uridine-5'-diphosphoglucuronosyltransferase 2B7
Type:
Enzyme
Mol. Mass.:
60705.98
Organism:
Homo sapiens (Human)
Description:
P16662
Residue:
529
  
Inhibitor
Name:
BDBM50370965
Synonyms:
CHEMBL1203943
Type:
Small organic molecule
Emp. Form.:
C18H33N
Mol. Mass.:
263.4613
SMILES:
CN(C)CC[C@H]1[C@H]2CC[C@@H]3[C@H]2C(C)(C)CCC[C@]13C
: