Target
UDP-glucuronosyltransferase 2B7
Ligand
BDBM50211749
Substrate
Meas. Tech.
ChEMBL_436438 (CHEMBL904746)
IC50
400±n/a nM
Citation
 Bichlmaier, IKurkela, MJoshi, TSiiskonen, ARüffer, TLang, HSuchanova, BVahermo, MFinel, MYli-Kauhaluoma, J Isoform-selective inhibition of the human UDP-glucuronosyltransferase 2B7 by isolongifolol derivatives. J Med Chem 50:2655-64 (2007)  
Target
Name:
UDP-glucuronosyltransferase 2B7
Synonyms:
2.4.1.17 UD2B7_HUMAN UDP-glucuronosyltransferase 2B9 UDPGT 2B9 UGT2B7 Uridine-5'-diphosphoglucuronosyltransferase 2B7
Type:
Enzyme
Mol. Mass.:
60705.98
Organism:
Homo sapiens (Human)
Description:
P16662
Residue:
529
  
Inhibitor
Name:
BDBM50211749
Synonyms:
CHEMBL390574 | ethyl (3R)-3-hydroxy-3-[(1R,2S,7S,8S,9S)-3,3,7-trimethyltricyclo[5.4.0.02,9]undec-8-yl]propanoate
Type:
Small organic molecule
Emp. Form.:
C19H32O3
Mol. Mass.:
308.4556
SMILES:
CCOC(=O)C[C@@H](O)[C@H]1[C@H]2CC[C@@H]3[C@H]2C(C)(C)CCC[C@]13C
: