Target
UDP-glucuronosyltransferase 2B7
Ligand
BDBM50211747
Substrate
Meas. Tech.
ChEMBL_436438 (CHEMBL904746)
IC50
2000±n/a nM
Citation
 Bichlmaier, IKurkela, MJoshi, TSiiskonen, ARüffer, TLang, HSuchanova, BVahermo, MFinel, MYli-Kauhaluoma, J Isoform-selective inhibition of the human UDP-glucuronosyltransferase 2B7 by isolongifolol derivatives. J Med Chem 50:2655-64 (2007)  
Target
Name:
UDP-glucuronosyltransferase 2B7
Synonyms:
2.4.1.17 UD2B7_HUMAN UDP-glucuronosyltransferase 2B9 UDPGT 2B9 UGT2B7 Uridine-5'-diphosphoglucuronosyltransferase 2B7
Type:
Enzyme
Mol. Mass.:
60705.98
Organism:
Homo sapiens (Human)
Description:
P16662
Residue:
529
  
Inhibitor
Name:
BDBM50211747
Synonyms:
(1S,3aR,4S,8aS,9S)-4,8,8-trimethyl-decahydro-1,4-methano-azulene-9-carboxylic acid | CHEMBL388542
Type:
Small organic molecule
Emp. Form.:
C15H24O2
Mol. Mass.:
236.3499
SMILES:
C[C@]12CCCC(C)(C)[C@H]3[C@H](CC[C@@H]13)[C@@H]2C(O)=O
: