Target
UDP-glucuronosyltransferase 2B7
Ligand
BDBM50211748
Substrate
Meas. Tech.
ChEMBL_436438 (CHEMBL904746)
IC50
800±n/a nM
Citation
 Bichlmaier, IKurkela, MJoshi, TSiiskonen, ARüffer, TLang, HSuchanova, BVahermo, MFinel, MYli-Kauhaluoma, J Isoform-selective inhibition of the human UDP-glucuronosyltransferase 2B7 by isolongifolol derivatives. J Med Chem 50:2655-64 (2007)  
Target
Name:
UDP-glucuronosyltransferase 2B7
Synonyms:
2.4.1.17 UD2B7_HUMAN UDP-glucuronosyltransferase 2B9 UDPGT 2B9 UGT2B7 Uridine-5'-diphosphoglucuronosyltransferase 2B7
Type:
Enzyme
Mol. Mass.:
60705.98
Organism:
Homo sapiens (Human)
Description:
P16662
Residue:
529
  
Inhibitor
Name:
BDBM50211748
Synonyms:
(1R)-2,2-dimethyl-1-[(1R,2S,7S,8S,9S)-3,3,7-trimethyltricyclo[5.4.0.02,9]undec-8-yl]propan-1-ol | CHEMBL376838
Type:
Small organic molecule
Emp. Form.:
C19H34O
Mol. Mass.:
278.4727
SMILES:
CC(C)(C)[C@H](O)[C@H]1[C@H]2CC[C@@H]3[C@H]2C(C)(C)CCC[C@]13C
: