Target
Beta-secretase 1
Ligand
BDBM50226439
Substrate
Meas. Tech.
ChEMBL_451971 (CHEMBL901129)
Kd
4450000±n/a nM
Citation
 Geschwindner, SOlsson, LLAlbert, JSDeinum, JEdwards, PDde Beer, TFolmer, RH Discovery of a novel warhead against beta-secretase through fragment-based lead generation. J Med Chem 50:5903-11 (2007)  
Target
Name:
Beta-secretase 1
Synonyms:
ASP2 Aspartyl protease 2 BACE1 Beta-secretase (BACE) Beta-secretase 1 (BACE 1) Beta-secretase 1 (BACE1) Beta-site amyloid precursor protein cleaving enzyme 1 Memapsin-2 beta-Secretase (BACE-1) | beta-Secretase (BACE1)
Type:
Protein
Mol. Mass.:
55755.10
Organism:
Homo sapiens (Human)
Description:
P56817
Residue:
501
  
Inhibitor
Name:
BDBM50226439
Synonyms:
2-amino-6-propylpyrimidin-4(3H)-one | CHEMBL235825
Type:
Small organic molecule
Emp. Form.:
C7H11N3O
Mol. Mass.:
153.1817
SMILES:
CCCc1cc(=O)[nH]c(N)n1
: