Target
3-oxoacyl-[acyl-carrier-protein] synthase 3
Ligand
BDBM50220622
Substrate
Meas. Tech.
ChEMBL_457362 (CHEMBL940953)
IC50
105000±n/a nM
Citation
 Bhowruth, VBrown, AKSenior, SJSnaith, JSBesra, GS Synthesis and biological evaluation of a C5-biphenyl thiolactomycin library. Bioorg Med Chem Lett 17:5643-6 (2007)  
Target
Name:
3-oxoacyl-[acyl-carrier-protein] synthase 3
Synonyms:
β-Ketoacyl-acyl carrier protein (ACP) synthase III (FabH) FABH_MYCTU | fabH
Type:
Enzyme
Mol. Mass.:
34865.07
Organism:
Mycobacterium tuberculosis
Description:
P9WNG3
Residue:
335
  
Inhibitor
Name:
BDBM50220622
Synonyms:
5-(4'-fluoro-biphenyl-4-ylmethyl)-4-hydroxy-3,5-dimethyl-5H-thiophen-2-one | CHEMBL250818
Type:
Small organic molecule
Emp. Form.:
C19H17FO2S
Mol. Mass.:
328.4
SMILES:
CC1C(=O)SC(C)(Cc2ccc(cc2)-c2ccc(F)cc2)C1=O
: