Target
Stromelysin-1
Ligand
BDBM50373178
Substrate
Meas. Tech.
ChEMBL_467083 (CHEMBL934766)
IC50
31000±n/a nM
Citation
 Ayers, SZink, DLPowell, JSBrown, CMGrund, ABills, GFPlatas, GThompson, DSingh, SB Noreupenifeldin, a tropolone from an unidentified ascomycete. J Nat Prod 71:457-9 (2008)  
Target
Name:
Stromelysin-1
Synonyms:
MMP-3 MMP3_HUMAN Matrix metalloproteinase 3 Matrix metalloproteinase-3 (MMP-3) SL-1 Stromelysin 1 | Transin-1
Type:
Enzyme
Mol. Mass.:
53973.13
Organism:
Homo sapiens (Human)
Description:
P08254
Residue:
477
  
Inhibitor
Name:
BDBM50373178
Synonyms:
PYCNIDIONE
Type:
Small organic molecule
Emp. Form.:
C33H40O7
Mol. Mass.:
548.6665
SMILES:
Cc1cc(=O)c(O)cc2O[C@]3(C)C\C=C\C(C)(C)C[C@@H]4Cc5c(O[C@@]4(C)[C@@H](O)C[C@H]3Cc12)cc(O)c(=O)cc5C
: