Target
Aromatase
Ligand
BDBM50182536
Substrate
Meas. Tech.
ChEMBL_468962 (CHEMBL952107)
IC50
2510±n/a nM
Citation
 Su, BTian, RDarby, MVBrueggemeier, RW Novel sulfonanilide analogs decrease aromatase activity in breast cancer cells: synthesis, biological evaluation, and ligand-based pharmacophore identification. J Med Chem 51:1126-35 (2008)  
Target
Name:
Aromatase
Synonyms:
ARO1 CP19A_HUMAN CYP19 CYPXIX Cytochrome P450 19A1 Cytochrome P450-C19 (CYP19) FL cytokine receptor precursor | P-450AROM
Type:
Enzyme
Mol. Mass.:
57888.92
Organism:
Homo sapiens (Human)
Description:
P11511
Residue:
503
  
Inhibitor
Name:
BDBM50182536
Synonyms:
CHEMBL204184 N-(4-nitro-2-propoxyphenyl)methanesulfonamide
Type:
Small organic molecule
Emp. Form.:
C10H14N2O5S
Mol. Mass.:
274.294
SMILES:
CCCOc1cc(ccc1NS(C)(=O)=O)[N+]([O-])=O
: