Target
Thymidine kinase
Ligand
BDBM50370388
Substrate
Meas. Tech.
ChEMBL_474153 (CHEMBL938411)
IC50
1500±n/a nM
Citation
 Focher, FLossani, AVerri, ASpadari, SMaioli, AGambino, JJWright, GEEberle, RBlack, DHMedveczky, PMedveczky, MShugar, D Sensitivity of monkey B virus (Cercopithecine herpesvirus 1) to antiviral drugs: role of thymidine kinase in antiviral activities of substrate analogs and acyclonucleosides. Antimicrob Agents Chemother 51:2028-34 (2007)  
Target
Name:
Thymidine kinase
Synonyms:
Type:
PROTEIN
Mol. Mass.:
40204.56
Organism:
Macacine herpesvirus 1
Description:
ChEMBL_474153
Residue:
370
  
Inhibitor
Name:
BDBM50370388
Synonyms:
5IUDR Allergan-211 Herplex IDU
Type:
Small organic molecule
Emp. Form.:
C9H11IN2O5
Mol. Mass.:
354.0985
SMILES:
OC[C@H]1O[C@H](C[C@@H]1O)n1cc(I)c(=O)[nH]c1=O
: