Target
Geranylgeranyl pyrophosphate synthase BTS1
Ligand
BDBM25289
Substrate
Meas. Tech.
ChEMBL_474166 (CHEMBL938424)
Ki
60±n/a nM
Citation
 Guo, RTCao, RLiang, PHKo, TPChang, THHudock, MPJeng, WYChen, CKZhang, YSong, YKuo, CJYin, FOldfield, EWang, AH Bisphosphonates target multiple sites in both cis- and trans-prenyltransferases. Proc Natl Acad Sci U S A 104:10022-7 (2007)  
Target
Name:
Geranylgeranyl pyrophosphate synthase BTS1
Synonyms:
BTS1 Geranylgeranyl diphosphate synthase (GGPPS) | Geranylgeranyl pyrophosphate synthase
Type:
Protein
Mol. Mass.:
38647.44
Organism:
Saccharomyces cerevisiae (Yeast)
Description:
Residue:
335
  
Inhibitor
Name:
BDBM25289
Synonyms:
bisphosphonate, 38 | {1-hydroxy-2-[3-(3-phenylphenyl)phenoxy]-1-phosphonoethyl}phosphonic acid
Type:
Small organic molecule
Emp. Form.:
C20H20O8P2
Mol. Mass.:
450.3155
SMILES:
OC(COc1cccc(c1)-c1cccc(c1)-c1ccccc1)(P(O)(O)=O)P(O)(O)=O
: