Target
Geranylgeranyl pyrophosphate synthase
Ligand
BDBM25289
Substrate
Meas. Tech.
ChEMBL_474167 (CHEMBL938425)
IC50
4100±n/a nM
Citation
 Guo, RTCao, RLiang, PHKo, TPChang, THHudock, MPJeng, WYChen, CKZhang, YSong, YKuo, CJYin, FOldfield, EWang, AH Bisphosphonates target multiple sites in both cis- and trans-prenyltransferases. Proc Natl Acad Sci U S A 104:10022-7 (2007)  
Target
Name:
Geranylgeranyl pyrophosphate synthase
Synonyms:
Dimethylallyltranstransferase GGPP synthetase GGPPSase Geranylgeranyl Diphosphate Synthase (GGPPS) Geranylgeranyl pyrophosphate synthetase | Geranyltranstransferase
Type:
Homooctamer; transferase
Mol. Mass.:
34867.94
Organism:
Homo sapiens (Human)
Description:
Recombinant human GGPPS was cloned and expressed in E. coli.
Residue:
300
  
Inhibitor
Name:
BDBM25289
Synonyms:
bisphosphonate, 38 | {1-hydroxy-2-[3-(3-phenylphenyl)phenoxy]-1-phosphonoethyl}phosphonic acid
Type:
Small organic molecule
Emp. Form.:
C20H20O8P2
Mol. Mass.:
450.3155
SMILES:
OC(COc1cccc(c1)-c1cccc(c1)-c1ccccc1)(P(O)(O)=O)P(O)(O)=O
: