Target
5-hydroxytryptamine receptor 7
Ligand
BDBM50375937
Substrate
Meas. Tech.
ChEMBL_474639 (CHEMBL921838)
IC50
350±n/a nM
Citation
 Na, YHHong, SHLee, JHPark, WKBaek, DJKoh, HYCho, YSChoo, HPae, AN Novel quinazolinone derivatives as 5-HT7 receptor ligands. Bioorg Med Chem 16:2570-8 (2008)  
Target
Name:
5-hydroxytryptamine receptor 7
Synonyms:
5-HT-7 5-HT7 5-HT7S 5HT7 HTR7 | Serotonin receptor 7
Type:
G Protein-Coupled Receptor (GPCR)
Mol. Mass.:
53573.08
Organism:
Homo sapiens (Human)
Description:
P34969
Residue:
479
  
Inhibitor
Name:
BDBM50375937
Synonyms:
CHEMBL259236
Type:
Small organic molecule
Emp. Form.:
C30H32FN5O3
Mol. Mass.:
529.6052
SMILES:
COc1ccc(cc1)N1CCN(CCCC(=O)NCc2nc3ccc(F)cc3c(=O)n2-c2ccccc2)CC1
: