Target
5-hydroxytryptamine receptor 2A
Ligand
BDBM50375919
Substrate
Meas. Tech.
ChEMBL_474642 (CHEMBL920900)
IC50
7900±n/a nM
Citation
 Na, YHHong, SHLee, JHPark, WKBaek, DJKoh, HYCho, YSChoo, HPae, AN Novel quinazolinone derivatives as 5-HT7 receptor ligands. Bioorg Med Chem 16:2570-8 (2008)  
Target
Name:
5-hydroxytryptamine receptor 2A
Synonyms:
5-HT-2 5-HT2A 5-hydroxytryptamine receptor 2A (5HT-2A) 5HT2A_HUMAN HTR2A | Serotonin receptor 2A
Type:
undefined
Mol. Mass.:
52607.65
Organism:
Homo sapiens (Human)
Description:
P28223
Residue:
471
  
Inhibitor
Name:
BDBM50375919
Synonyms:
CHEMBL406221
Type:
Small organic molecule
Emp. Form.:
C32H36FN5O4
Mol. Mass.:
573.6577
SMILES:
CCOc1ccccc1N1CCN(CCCC(=O)NCc2nc3ccc(F)cc3c(=O)n2-c2ccc(OC)cc2)CC1
: