Target
11-beta-hydroxysteroid dehydrogenase 1
Ligand
BDBM50377712
Substrate
Meas. Tech.
ChEMBL_479968 (CHEMBL932361)
IC50
1.3±n/a nM
Citation
 Aster, SDGraham, DWKharbanda, DPatel, GPonpipom, MSantorelli, GMSzymonifka, MJMundt, SSShah, KSpringer, MSThieringer, RHermanowski-Vosatka, AWright, SDXiao, JZokian, HBalkovec, JM Bis-aryl triazoles as selective inhibitors of 11beta-hydroxysteroid dehydrogenase type 1. Bioorg Med Chem Lett 18:2799-804 (2008)  
Target
Name:
11-beta-hydroxysteroid dehydrogenase 1
Synonyms:
11-DH 11-beta-Hydroxysteroid Dehydrogenase 1 (11-beta-HSD1) 11-beta-hydroxysteroid dehydrogenase 1 (11HSD1) Corticosteroid 11-beta-dehydrogenase isozyme 1 (11-beta-HSD-1) Corticosteroid 11-beta-dehydrogenase isozyme 1 (11beta-HSD1) HSD11 HSD11L | SDR26C1
Type:
Enzyme
Mol. Mass.:
32409.16
Organism:
Homo sapiens (Human)
Description:
P28845
Residue:
292
  
Inhibitor
Name:
BDBM50377712
Synonyms:
CHEMBL401909
Type:
Small organic molecule
Emp. Form.:
C17H11F6N3O
Mol. Mass.:
387.2792
SMILES:
Cn1c(nnc1-c1ccccc1C(F)(F)F)-c1ccccc1OC(F)(F)F
: