Target
11-beta-hydroxysteroid dehydrogenase 1
Ligand
BDBM50377868
Substrate
Meas. Tech.
ChEMBL_480088 (CHEMBL934813)
IC50
2±n/a nM
Citation
 Zhu, YOlson, SHGraham, DPatel, GHermanowski-Vosatka, AMundt, SShah, KSpringer, MThieringer, RWright, SXiao, JZokian, HDragovic, JBalkovec, JM Phenylcyclobutyl triazoles as selective inhibitors of 11beta-hydroxysteroid dehydrogenase type I. Bioorg Med Chem Lett 18:3412-6 (2008)  
Target
Name:
11-beta-hydroxysteroid dehydrogenase 1
Synonyms:
11-DH 11-beta-Hydroxysteroid Dehydrogenase 1 (11-beta-HSD1) 11-beta-hydroxysteroid dehydrogenase 1 (11HSD1) Corticosteroid 11-beta-dehydrogenase isozyme 1 (11-beta-HSD-1) Corticosteroid 11-beta-dehydrogenase isozyme 1 (11beta-HSD1) HSD11 HSD11L | SDR26C1
Type:
Enzyme
Mol. Mass.:
32409.16
Organism:
Homo sapiens (Human)
Description:
P28845
Residue:
292
  
Inhibitor
Name:
BDBM50377868
Synonyms:
CHEMBL255660
Type:
Small organic molecule
Emp. Form.:
C18H22FN3
Mol. Mass.:
299.3858
SMILES:
Fc1cccc(c1)C1(CCC1)c1nnc2CCCCCCn12
: