Target
11-beta-hydroxysteroid dehydrogenase type 2
Ligand
BDBM50377868
Substrate
Meas. Tech.
ChEMBL_480091 (CHEMBL934816)
IC50
>4000±n/a nM
Citation
 Zhu, YOlson, SHGraham, DPatel, GHermanowski-Vosatka, AMundt, SShah, KSpringer, MThieringer, RWright, SXiao, JZokian, HDragovic, JBalkovec, JM Phenylcyclobutyl triazoles as selective inhibitors of 11beta-hydroxysteroid dehydrogenase type I. Bioorg Med Chem Lett 18:3412-6 (2008)  
Target
Name:
11-beta-hydroxysteroid dehydrogenase type 2
Synonyms:
11-DH2 11-beta-Hydroxysteroid Dehydrogenase 2 (11-beta-HSD2) Corticosteroid 11-beta-dehydrogenase isozyme 2 Hsd11b2 NAD-dependent 11-beta-hydroxysteroid dehydrogenase
Type:
Enzyme
Mol. Mass.:
42201.46
Organism:
Mus musculus (mouse)
Description:
Purified recombinant mouse 11beta-HSD2.
Residue:
386
  
Inhibitor
Name:
BDBM50377868
Synonyms:
CHEMBL255660
Type:
Small organic molecule
Emp. Form.:
C18H22FN3
Mol. Mass.:
299.3858
SMILES:
Fc1cccc(c1)C1(CCC1)c1nnc2CCCCCCn12
: