Target
Sodium-dependent serotonin transporter
Ligand
BDBM50254209
Substrate
Meas. Tech.
ChEMBL_560275 (CHEMBL1020453)
Ki
93±n/a nM
Citation
 Zeng, FMun, JJarkas, NStehouwer, JSVoll, RJTamagnan, GDHowell, LVotaw, JRKilts, CDNemeroff, CBGoodman, MM Synthesis, radiosynthesis, and biological evaluation of carbon-11 and fluorine-18 labeled reboxetine analogues: potential positron emission tomography radioligands for in vivo imaging of the norepinephrine transporter. J Med Chem 52:62-73 (2009)  
Target
Name:
Sodium-dependent serotonin transporter
Synonyms:
5-HT Transporter 5HTT SC6A4_HUMAN SLC6A4 Serotonin transporter (5HTT) Sodium-dependent serotonin transporter (SERT) | Solute carrier family 6 member 4
Type:
Multi-pass membrane protein
Mol. Mass.:
70322.51
Organism:
Homo sapiens (Human)
Description:
P31645
Residue:
630
  
Inhibitor
Name:
BDBM50254209
Synonyms:
(2S,3S)-2-[alpha-(2-Methylphenoxy)phenylmethyl]morpholine | CHEMBL467432
Type:
Small organic molecule
Emp. Form.:
C18H21NO2
Mol. Mass.:
283.3648
SMILES:
Cc1ccccc1O[C@H]([C@@H]1CNCCO1)c1ccccc1
: