Target
Sodium-dependent noradrenaline transporter
Ligand
BDBM50254211
Substrate
Meas. Tech.
ChEMBL_560274 (CHEMBL1020452)
Ki
3.68±n/a nM
Citation
 Zeng, FMun, JJarkas, NStehouwer, JSVoll, RJTamagnan, GDHowell, LVotaw, JRKilts, CDNemeroff, CBGoodman, MM Synthesis, radiosynthesis, and biological evaluation of carbon-11 and fluorine-18 labeled reboxetine analogues: potential positron emission tomography radioligands for in vivo imaging of the norepinephrine transporter. J Med Chem 52:62-73 (2009)  
Target
Name:
Sodium-dependent noradrenaline transporter
Synonyms:
Monoamine transporter NET Noradrenaline Transporter (NET) Norepinephrine transporter protein (NET) SLC6A2 Sodium-dependent noradrenaline transporter (NET) | Solute carrier family 6 member 2
Type:
Multi-pass membrane protein
Mol. Mass.:
69337.72
Organism:
Homo sapiens (Human)
Description:
P23975
Residue:
617
  
Inhibitor
Name:
BDBM50254211
Synonyms:
(2S,3S)-2-[alpha-(2-(3-Fluoropropyl)phenoxy)phenylmethyl]morpholine | CHEMBL505592
Type:
Small organic molecule
Emp. Form.:
C20H24FNO2
Mol. Mass.:
329.4085
SMILES:
FCCCc1ccccc1O[C@H]([C@@H]1CNCCO1)c1ccccc1
: