Target
Bifunctional epoxide hydrolase 2
Ligand
BDBM50295542
Substrate
Meas. Tech.
ChEMBL_580015 (CHEMBL1051703)
IC50
17±n/a nM
Citation
 Shen, HCDing, FXWang, SDeng, QZhang, XChen, YZhou, GXu, SChen, HSTong, XTong, VMitra, KKumar, STsai, CStevenson, ASPai, LYAlonso-Galicia, MChen, XSoisson, SMRoy, SZhang, BTata, JRBerger, JPColletti, SL Discovery of a highly potent, selective, and bioavailable soluble epoxide hydrolase inhibitor with excellent ex vivo target engagement. J Med Chem 52:5009-12 (2010)  
Target
Name:
Bifunctional epoxide hydrolase 2
Synonyms:
Ephx2 HYES_RAT
Type:
PROTEIN
Mol. Mass.:
62337.15
Organism:
Rattus norvegicus
Description:
ChEMBL_1465995
Residue:
554
  
Inhibitor
Name:
BDBM50295542
Synonyms:
4-(5-(1-(2-phenylcyclopropylcarbamoyl)piperidin-4-yl)-1,2,4-oxadiazol-3-yl)benzoic acid | CHEMBL559531
Type:
Small organic molecule
Emp. Form.:
C24H24N4O4
Mol. Mass.:
432.4718
SMILES:
OC(=O)c1ccc(cc1)-c1noc(n1)C1CCN(CC1)C(=O)NC1CC1c1ccccc1
: