Target
Bifunctional epoxide hydrolase 2
Ligand
BDBM50295538
Substrate
Meas. Tech.
ChEMBL_580015 (CHEMBL1051703)
IC50
48±n/a nM
Citation
 Shen, HCDing, FXWang, SDeng, QZhang, XChen, YZhou, GXu, SChen, HSTong, XTong, VMitra, KKumar, STsai, CStevenson, ASPai, LYAlonso-Galicia, MChen, XSoisson, SMRoy, SZhang, BTata, JRBerger, JPColletti, SL Discovery of a highly potent, selective, and bioavailable soluble epoxide hydrolase inhibitor with excellent ex vivo target engagement. J Med Chem 52:5009-12 (2010)  
Target
Name:
Bifunctional epoxide hydrolase 2
Synonyms:
Ephx2 HYES_RAT
Type:
PROTEIN
Mol. Mass.:
62337.15
Organism:
Rattus norvegicus
Description:
ChEMBL_1465995
Residue:
554
  
Inhibitor
Name:
BDBM50295538
Synonyms:
4-(3-methyl-1,2,4-oxadiazol-5-yl)-N-(2-phenylcyclopropyl)piperidine-1-carboxamide | CHEMBL564547
Type:
Small organic molecule
Emp. Form.:
C18H22N4O2
Mol. Mass.:
326.3929
SMILES:
Cc1noc(n1)C1CCN(CC1)C(=O)NC1CC1c1ccccc1
: