Target
Bifunctional epoxide hydrolase 2
Ligand
BDBM50295540
Substrate
Meas. Tech.
ChEMBL_580015 (CHEMBL1051703)
IC50
6±n/a nM
Citation
 Shen, HCDing, FXWang, SDeng, QZhang, XChen, YZhou, GXu, SChen, HSTong, XTong, VMitra, KKumar, STsai, CStevenson, ASPai, LYAlonso-Galicia, MChen, XSoisson, SMRoy, SZhang, BTata, JRBerger, JPColletti, SL Discovery of a highly potent, selective, and bioavailable soluble epoxide hydrolase inhibitor with excellent ex vivo target engagement. J Med Chem 52:5009-12 (2010)  
Target
Name:
Bifunctional epoxide hydrolase 2
Synonyms:
Ephx2 HYES_RAT
Type:
PROTEIN
Mol. Mass.:
62337.15
Organism:
Rattus norvegicus
Description:
ChEMBL_1465995
Residue:
554
  
Inhibitor
Name:
BDBM50295540
Synonyms:
CHEMBL561788 | N-(2-phenylcyclopropyl)-4-(3-(2-(trifluoromethyl)phenyl)-1,2,4-oxadiazol-5-yl)piperidine-1-carboxamide
Type:
Small organic molecule
Emp. Form.:
C24H23F3N4O2
Mol. Mass.:
456.4602
SMILES:
FC(F)(F)c1ccccc1-c1noc(n1)C1CCN(CC1)C(=O)NC1CC1c1ccccc1
: