Target
Bifunctional epoxide hydrolase 2
Ligand
BDBM50295549
Substrate
Meas. Tech.
ChEMBL_580016 (CHEMBL1051704)
IC50
7±n/a nM
Citation
 Shen, HCDing, FXWang, SDeng, QZhang, XChen, YZhou, GXu, SChen, HSTong, XTong, VMitra, KKumar, STsai, CStevenson, ASPai, LYAlonso-Galicia, MChen, XSoisson, SMRoy, SZhang, BTata, JRBerger, JPColletti, SL Discovery of a highly potent, selective, and bioavailable soluble epoxide hydrolase inhibitor with excellent ex vivo target engagement. J Med Chem 52:5009-12 (2010)  
Target
Name:
Bifunctional epoxide hydrolase 2
Synonyms:
Cytosolic epoxide hydrolase 2 EPHX2 HYES_HUMAN Soluble epoxide hydrolase (sEH) | epoxide hydrolase 2, cytoplasmic
Type:
Enzyme
Mol. Mass.:
62613.07
Organism:
Homo sapiens (Human)
Description:
P34913
Residue:
555
  
Inhibitor
Name:
BDBM50295549
Synonyms:
4-(3-(pyridin-2-yl)-1,2,4-oxadiazol-5-yl)-N-(4-(trifluoromethyl)phenyl)piperidine-1-carboxamide | CHEMBL555347
Type:
Small organic molecule
Emp. Form.:
C20H18F3N5O2
Mol. Mass.:
417.3844
SMILES:
FC(F)(F)c1ccc(NC(=O)N2CCC(CC2)c2nc(no2)-c2ccccn2)cc1
: