Target
Bifunctional epoxide hydrolase 2
Ligand
BDBM50295532
Substrate
Meas. Tech.
ChEMBL_580014 (CHEMBL1051702)
IC50
8±n/a nM
Citation
 Shen, HCDing, FXWang, SDeng, QZhang, XChen, YZhou, GXu, SChen, HSTong, XTong, VMitra, KKumar, STsai, CStevenson, ASPai, LYAlonso-Galicia, MChen, XSoisson, SMRoy, SZhang, BTata, JRBerger, JPColletti, SL Discovery of a highly potent, selective, and bioavailable soluble epoxide hydrolase inhibitor with excellent ex vivo target engagement. J Med Chem 52:5009-12 (2010)  
Target
Name:
Bifunctional epoxide hydrolase 2
Synonyms:
Cytosolic epoxide hydrolase 2 EPHX2 HYES_HUMAN Soluble epoxide hydrolase (sEH) | epoxide hydrolase 2, cytoplasmic
Type:
Enzyme
Mol. Mass.:
62613.07
Organism:
Homo sapiens (Human)
Description:
P34913
Residue:
555
  
Inhibitor
Name:
BDBM50295532
Synonyms:
4-(3-(pyridin-2-yl)-1,2,4-oxadiazol-5-yl)-N-(1,2,3,4-tetrahydronaphthalen-2-yl)piperidine-1-carboxamide | CHEMBL550242
Type:
Small organic molecule
Emp. Form.:
C23H25N5O2
Mol. Mass.:
403.4769
SMILES:
O=C(NC1CCc2ccccc2C1)N1CCC(CC1)c1nc(no1)-c1ccccn1
: