Target
Bifunctional epoxide hydrolase 2
Ligand
BDBM50295534
Substrate
Meas. Tech.
ChEMBL_580015 (CHEMBL1051703)
IC50
27±n/a nM
Citation
 Shen, HCDing, FXWang, SDeng, QZhang, XChen, YZhou, GXu, SChen, HSTong, XTong, VMitra, KKumar, STsai, CStevenson, ASPai, LYAlonso-Galicia, MChen, XSoisson, SMRoy, SZhang, BTata, JRBerger, JPColletti, SL Discovery of a highly potent, selective, and bioavailable soluble epoxide hydrolase inhibitor with excellent ex vivo target engagement. J Med Chem 52:5009-12 (2010)  
Target
Name:
Bifunctional epoxide hydrolase 2
Synonyms:
Ephx2 HYES_RAT
Type:
PROTEIN
Mol. Mass.:
62337.15
Organism:
Rattus norvegicus
Description:
ChEMBL_1465995
Residue:
554
  
Inhibitor
Name:
BDBM50295534
Synonyms:
CHEMBL562822 | N-((1R,2S)-2-phenylcyclopropyl)-4-(3-(pyridin-2-yl)-1,2,4-oxadiazol-5-yl)piperidine-1-carboxamide
Type:
Small organic molecule
Emp. Form.:
C22H23N5O2
Mol. Mass.:
389.4503
SMILES:
O=C(N[C@@H]1C[C@H]1c1ccccc1)N1CCC(CC1)c1nc(no1)-c1ccccn1
: