Target
Bifunctional epoxide hydrolase 2
Ligand
BDBM50295535
Substrate
Meas. Tech.
ChEMBL_580016 (CHEMBL1051704)
IC50
1±n/a nM
Citation
 Shen, HCDing, FXWang, SDeng, QZhang, XChen, YZhou, GXu, SChen, HSTong, XTong, VMitra, KKumar, STsai, CStevenson, ASPai, LYAlonso-Galicia, MChen, XSoisson, SMRoy, SZhang, BTata, JRBerger, JPColletti, SL Discovery of a highly potent, selective, and bioavailable soluble epoxide hydrolase inhibitor with excellent ex vivo target engagement. J Med Chem 52:5009-12 (2010)  
Target
Name:
Bifunctional epoxide hydrolase 2
Synonyms:
Cytosolic epoxide hydrolase 2 EPHX2 HYES_HUMAN Soluble epoxide hydrolase (sEH) | epoxide hydrolase 2, cytoplasmic
Type:
Enzyme
Mol. Mass.:
62613.07
Organism:
Homo sapiens (Human)
Description:
P34913
Residue:
555
  
Inhibitor
Name:
BDBM50295535
Synonyms:
1-butyl-N-(2,3-dimethoxybenzyl)-2-(3,4,5-trimethoxyphenyl)-1H-benzo[d]imidazole-5-carboxamide | CHEMBL550648
Type:
Small organic molecule
Emp. Form.:
C30H35N3O6
Mol. Mass.:
533.6154
SMILES:
CCCCn1c(nc2cc(ccc12)C(=O)NCc1cccc(OC)c1OC)-c1cc(OC)c(OC)c(OC)c1
: