Target
Bifunctional epoxide hydrolase 2
Ligand
BDBM25737
Substrate
Meas. Tech.
ChEMBL_580036 (CHEMBL1053986)
IC50
7±n/a nM
Citation
 Shen, HCDing, FXWang, SDeng, QZhang, XChen, YZhou, GXu, SChen, HSTong, XTong, VMitra, KKumar, STsai, CStevenson, ASPai, LYAlonso-Galicia, MChen, XSoisson, SMRoy, SZhang, BTata, JRBerger, JPColletti, SL Discovery of a highly potent, selective, and bioavailable soluble epoxide hydrolase inhibitor with excellent ex vivo target engagement. J Med Chem 52:5009-12 (2010)  
Target
Name:
Bifunctional epoxide hydrolase 2
Synonyms:
Eph2 Epoxide hydratase Soluble epoxide hydrolase (sEH)
Type:
Enzyme
Mol. Mass.:
62512.06
Organism:
Mus musculus (Mouse)
Description:
P34914
Residue:
554
  
Inhibitor
Name:
BDBM25737
Synonyms:
12-[(adamantan-1-ylcarbamoyl)amino]dodecanoic acid US10383835, Compound 700 | Urea-based compound, 18
Type:
Small organic molecule
Emp. Form.:
C23H40N2O3
Mol. Mass.:
392.5753
SMILES:
OC(=O)CCCCCCCCCCCNC(=O)NC12CC3CC(CC(C3)C1)C2
: