Target
Penicillin-binding protein 2X
Ligand
BDBM50300687
Substrate
Meas. Tech.
ChEMBL_589475 (CHEMBL1053623)
IC50
>1000000±n/a nM
Citation
 Miguet, LZervosen, AGerards, TPasha, FALuxen, ADistèche-Nguyen, MThomas, A Discovery of new inhibitors of resistant Streptococcus pneumoniae penicillin binding protein (PBP) 2x by structure-based virtual screening. J Med Chem 52:5926-36 (2009)  
Target
Name:
Penicillin-binding protein 2X
Synonyms:
PBP-2X PBPX_STRR6 | pbpX
Type:
PROTEIN
Mol. Mass.:
82337.09
Organism:
Streptococcus pneumoniae R6
Description:
ChEMBL_822530
Residue:
750
  
Inhibitor
Name:
BDBM50300687
Synonyms:
2-(5-((4-chlorophenylthio)methyl)-1,3,4-thiadiazol-2-ylamino)-5-methylbenzenesulfonic acid | CHEMBL573503
Type:
Small organic molecule
Emp. Form.:
C16H14ClN3O3S3
Mol. Mass.:
427.949
SMILES:
Cc1ccc(Nc2nnc(CSc3ccc(Cl)cc3)s2)c(c1)S(O)(=O)=O
: