Target
Peroxisome proliferator-activated receptor alpha
Ligand
BDBM50303986
Substrate
Meas. Tech.
ChEMBL_595405 (CHEMBL1039204)
EC50
300±n/a nM
Citation
 Mizuno, CSChittiboyina, AGShah, FHPatny, AKurtz, TWPershadsingh, HASpeth, RCKaramyan, VTCarvalho, PBAvery, MA Design, synthesis, and docking studies of novel benzimidazoles for the treatment of metabolic syndrome. J Med Chem 53:1076-85 (2010)  
Target
Name:
Peroxisome proliferator-activated receptor alpha
Synonyms:
NR1C1 PPAR PPAR-alpha PPARA_HUMAN Peroxisome proliferator-activated receptor | Peroxisome proliferator-activated receptor alpha (PPAR alpha)
Type:
Enzyme
Mol. Mass.:
52222.08
Organism:
Homo sapiens (Human)
Description:
Q07869
Residue:
468
  
Inhibitor
Name:
BDBM50303986
Synonyms:
CHEMBL584704 | Ethyl 2-Methyl-3-(4-(2-(4-methyl-2-propyl-1H-benzo[d]imidazol-1-yl)ethoxy)-phenyl)-2-phe-noxypropanoate
Type:
Small organic molecule
Emp. Form.:
C31H36N2O4
Mol. Mass.:
500.6285
SMILES:
CCCc1nc2c(C)cccc2n1CCOc1ccc(CC(C)(Oc2ccccc2)C(=O)OCC)cc1
: