Target
5'-nucleotidase
Ligand
BDBM50227019
Substrate
Meas. Tech.
ChEMBL_612633 (CHEMBL1065670)
Ki
4810±n/a nM
Citation
 Baqi, YLee, SYIqbal, JRipphausen, PLehr, AScheiff, ABZimmermann, HBajorath, JMüller, CE Development of potent and selective inhibitors of ecto-5'-nucleotidase based on an anthraquinone scaffold. J Med Chem 53:2076-86 (2010)  
Target
Name:
5'-nucleotidase
Synonyms:
5'-nucleotidase Ecto-5'-nucleotidase (e5'NT) NT Nt5e | Nte
Type:
Enzyme
Mol. Mass.:
63971.44
Organism:
Rattus norvegicus (Rat)
Description:
P21588
Residue:
576
  
Inhibitor
Name:
BDBM50227019
Synonyms:
CHEMBL271673 | sodium 1-amino-4-(4-chlorophenylamino)-9,10-dioxo-9,10-dihydroanthracene-2-sulfonate
Type:
Small organic molecule
Emp. Form.:
C20H12ClN2O5S
Mol. Mass.:
427.838
SMILES:
Nc1c(cc(Nc2ccc(Cl)cc2)c2C(=O)c3ccccc3C(=O)c12)S([O-])(=O)=O
: