Target
Synaptic vesicular amine transporter
Ligand
BDBM50171947
Substrate
Meas. Tech.
ChEMBL_610810 (CHEMBL1068127)
Ki
630±n/a nM
Citation
 Hojahmat, MHorton, DBNorrholm, SDMiller, DKGrinevich, VPDeaciuc, AGDwoskin, LPCrooks, PA Lobeline esters as novel ligands for neuronal nicotinic acetylcholine receptors and neurotransmitter transporters. Bioorg Med Chem 18:640-9 (2010)  
Target
Name:
Synaptic vesicular amine transporter
Synonyms:
Monoamine transporter SVMT VAT2 VMAT2_HUMAN | Vesicular amine transporter 2
Type:
PROTEIN
Mol. Mass.:
55709.61
Organism:
Homo sapiens (Human)
Description:
ChEMBL_610810
Residue:
514
  
Inhibitor
Name:
BDBM50171947
Synonyms:
(2R,6S)-1-Methyl-2,6-bis-(2-naphthalen-1-yl-ethyl)-piperidine N-methyl-2,6-cis-bis(naphthalene-1-ethyl)-piperidine
Type:
Small organic molecule
Emp. Form.:
C30H33N
Mol. Mass.:
407.5897
SMILES:
CN1[C@@H](CCc2cccc3ccccc23)CCC[C@H]1CCc1cccc2ccccc12
: