Target
Sodium-dependent serotonin transporter
Ligand
BDBM50309687
Substrate
Meas. Tech.
ChEMBL_610803 (CHEMBL1068120)
Ki
2070±n/a nM
Citation
 Hojahmat, MHorton, DBNorrholm, SDMiller, DKGrinevich, VPDeaciuc, AGDwoskin, LPCrooks, PA Lobeline esters as novel ligands for neuronal nicotinic acetylcholine receptors and neurotransmitter transporters. Bioorg Med Chem 18:640-9 (2010)  
Target
Name:
Sodium-dependent serotonin transporter
Synonyms:
5-HT Transporter 5HT transporter Anandamid membrane transporter, AMT Monoamine transporters; Norepinephrine & serotonin Slc6a4 Sodium-dependent serotonin transporter (SERT) | imipramine receptor
Type:
Multi-pass membrane protein
Mol. Mass.:
70168.43
Organism:
Rattus norvegicus (rat)
Description:
P31652
Residue:
630
  
Inhibitor
Name:
BDBM50309687
Synonyms:
(2S,6S,2R)-2-[6-(2-Benzoyloxy-2-phenylethyl)-1-methylpiperidin-2-yl]-1-phenylethanone hydrochloride | CHEMBL599693
Type:
Small organic molecule
Emp. Form.:
C29H31NO3
Mol. Mass.:
441.5613
SMILES:
CN1[C@H](C[C@H](OC(=O)c2ccccc2)c2ccccc2)CCC[C@@H]1CC(=O)c1ccccc1
: