Target
Synaptic vesicular amine transporter
Ligand
BDBM50309673
Substrate
Meas. Tech.
ChEMBL_610807 (CHEMBL1068124)
Ki
2480±n/a nM
Citation
 Hojahmat, MHorton, DBNorrholm, SDMiller, DKGrinevich, VPDeaciuc, AGDwoskin, LPCrooks, PA Lobeline esters as novel ligands for neuronal nicotinic acetylcholine receptors and neurotransmitter transporters. Bioorg Med Chem 18:640-9 (2010)  
Target
Name:
Synaptic vesicular amine transporter
Synonyms:
Monoamine transporter Solute carrier family 18 member 2 Synaptic vesicular amine transporter VMAT2_RAT Vesicular monoamine transporter 2 (VMAT2) | Vmat2
Type:
Protein
Mol. Mass.:
55689.58
Organism:
Rattus norvegicus (Rat)
Description:
Q01827
Residue:
515
  
Inhibitor
Name:
BDBM50309673
Synonyms:
(2S,6S,2R)-2-[6-(2-(2-Naphthalene)-sulfonyloxy-2-phenylethyl)-1-methylpiperidin-2-yl]-1-phenylethanone hydrochloride | CHEMBL599267
Type:
Small organic molecule
Emp. Form.:
C32H33NO4S
Mol. Mass.:
527.674
SMILES:
CN1[C@H](C[C@H](OS(=O)(=O)c2ccc3ccccc3c2)c2ccccc2)CCC[C@@H]1CC(=O)c1ccccc1
: