Target
Synaptic vesicular amine transporter
Ligand
BDBM50309672
Substrate
Meas. Tech.
ChEMBL_610807 (CHEMBL1068124)
Ki
2090±n/a nM
Citation
 Hojahmat, MHorton, DBNorrholm, SDMiller, DKGrinevich, VPDeaciuc, AGDwoskin, LPCrooks, PA Lobeline esters as novel ligands for neuronal nicotinic acetylcholine receptors and neurotransmitter transporters. Bioorg Med Chem 18:640-9 (2010)  
Target
Name:
Synaptic vesicular amine transporter
Synonyms:
Monoamine transporter Solute carrier family 18 member 2 Synaptic vesicular amine transporter VMAT2_RAT Vesicular monoamine transporter 2 (VMAT2) | Vmat2
Type:
Protein
Mol. Mass.:
55689.58
Organism:
Rattus norvegicus (Rat)
Description:
Q01827
Residue:
515
  
Inhibitor
Name:
BDBM50309672
Synonyms:
(2S,6S,2R)-2-[6-(2-Isopropylsulfonyloxy-2-phenylethyl)-1-methylpiperidin-2-yl]-1-phenylethanone hydrochloride | CHEMBL599268
Type:
Small organic molecule
Emp. Form.:
C25H33NO4S
Mol. Mass.:
443.599
SMILES:
CC(C)S(=O)(=O)O[C@@H](C[C@@H]1CCC[C@H](CC(=O)c2ccccc2)N1C)c1ccccc1
: