Target
Sodium-dependent dopamine transporter
Ligand
BDBM50309685
Substrate
Meas. Tech.
ChEMBL_610802 (CHEMBL1068119)
Ki
2060±n/a nM
Citation
 Hojahmat, MHorton, DBNorrholm, SDMiller, DKGrinevich, VPDeaciuc, AGDwoskin, LPCrooks, PA Lobeline esters as novel ligands for neuronal nicotinic acetylcholine receptors and neurotransmitter transporters. Bioorg Med Chem 18:640-9 (2010)  
Target
Name:
Sodium-dependent dopamine transporter
Synonyms:
DA transporter SC6A3_RAT Sodium-dependent dopamine transporter | Sodium-dependent dopamine transporter (DAT)
Type:
Multi-pass membrane protein
Mol. Mass.:
68749.45
Organism:
Rattus norvegicus (rat)
Description:
P23977
Residue:
619
  
Inhibitor
Name:
BDBM50309685
Synonyms:
(2S,6S,2R)-2-[6-(2-Toluyloxy-2-phenylethyl)-1-methylpiperidin-2-yl]-1-phenylethanone hydrochloride | CHEMBL599081
Type:
Small organic molecule
Emp. Form.:
C30H33NO3
Mol. Mass.:
455.5879
SMILES:
CN1[C@H](C[C@H](OC(=O)c2ccc(C)cc2)c2ccccc2)CCC[C@@H]1CC(=O)c1ccccc1
: