Target
Beta-2 adrenergic receptor
Ligand
BDBM50313975
Substrate
Meas. Tech.
ChEMBL_615505 (CHEMBL1105983)
IC50
16000±n/a nM
Citation
 Goble, SDWang, LHowell, KLBansal, ABerger, RBrockunier, LDiSalvo, JFeighner, SHarper, BHe, JHurley, AHreniuk, DParmee, ERobbins, MSalituro, GSanfiz, AStreckfuss, EWatkins, EWeber, AEStruthers, MEdmondson, SD Heterocyclic acetamide and benzamide derivatives as potent and selective beta3-adrenergic receptor agonists with improved rodent pharmacokinetic profiles. Bioorg Med Chem Lett 20:1895-9 (2010)  
Target
Name:
Beta-2 adrenergic receptor
Synonyms:
ADRB2 ADRB2_HUMAN Beta-2 adrenoceptor | Beta-2 adrenoreceptor
Type:
Mol. Mass.:
46461.69
Organism:
Homo sapiens (Human)
Description:
P07550
Residue:
413
  
Inhibitor
Name:
BDBM50313975
Synonyms:
(R)-N-(4-(2-(2-hydroxy-2-(pyridin-3-yl)ethylamino)ethyl)phenyl)-4-methyl-2-(pyrrolidin-1-yl)benzamide | CHEMBL1078876
Type:
Small organic molecule
Emp. Form.:
C27H32N4O2
Mol. Mass.:
444.5686
SMILES:
Cc1ccc(C(=O)Nc2ccc(CCNC[C@H](O)c3cccnc3)cc2)c(c1)N1CCCC1
: