Target
Beta-1 adrenergic receptor
Ligand
BDBM50313974
Substrate
Meas. Tech.
ChEMBL_615506 (CHEMBL1105984)
IC50
12000±n/a nM
Citation
 Goble, SDWang, LHowell, KLBansal, ABerger, RBrockunier, LDiSalvo, JFeighner, SHarper, BHe, JHurley, AHreniuk, DParmee, ERobbins, MSalituro, GSanfiz, AStreckfuss, EWatkins, EWeber, AEStruthers, MEdmondson, SD Heterocyclic acetamide and benzamide derivatives as potent and selective beta3-adrenergic receptor agonists with improved rodent pharmacokinetic profiles. Bioorg Med Chem Lett 20:1895-9 (2010)  
Target
Name:
Beta-1 adrenergic receptor
Synonyms:
ADRB1 ADRB1_HUMAN Beta-1 adrenoceptor adrenergic Beta1
Type:
G Protein-Coupled Receptor (GPCR)
Mol. Mass.:
51338.40
Organism:
Homo sapiens (Human)
Description:
P08588
Residue:
477
  
Inhibitor
Name:
BDBM50313974
Synonyms:
(R)-N-(4-(2-(2-hydroxy-2-(pyridin-3-yl)ethylamino)ethyl)phenyl)-5-methyl-2-(pyrrolidin-1-yl)benzamide | CHEMBL1078696
Type:
Small organic molecule
Emp. Form.:
C27H32N4O2
Mol. Mass.:
444.5686
SMILES:
Cc1ccc(N2CCCC2)c(c1)C(=O)Nc1ccc(CCNC[C@H](O)c2cccnc2)cc1
: