Target
Cathepsin B
Ligand
BDBM50322341
Substrate
Meas. Tech.
ChEMBL_642741 (CHEMBL1177221)
Ki
39100±n/a nM
Citation
 Bova, FEttari, RMicale, NCarnovale, CSchirmeister, TGelhaus, CLeippe, MGrasso, SZappalà, M Constrained peptidomimetics as antiplasmodial falcipain-2 inhibitors. Bioorg Med Chem 18:4928-38 (2010)  
Target
Name:
Cathepsin B
Synonyms:
APP secretase CATB_HUMAN CTSB Cathepsin B light chain | Cathepsin B1
Type:
Enzyme
Mol. Mass.:
37819.69
Organism:
Homo sapiens (Human)
Description:
gi_63102437
Residue:
339
  
Inhibitor
Name:
BDBM50322341
Synonyms:
CHEMBL1171803 | Methyl4-(2-((R)-3-((4-chloro-2-(trifluoromethyl)phenylcarbamoyloxy)methyl-2-oxo-5-phenyl-2,3-dihydro-1H-benzo[e][1,4]diazepin-1-yl)acetamido)-6-methylhept-2-enoate
Type:
Small organic molecule
Emp. Form.:
C35H34ClF3N4O6
Mol. Mass.:
699.116
SMILES:
COC(=O)\C=C\[C@H](CC(C)C)NC(=O)CN1c2ccccc2C(=N[C@H](COC(=O)Nc2ccc(Cl)cc2C(F)(F)F)C1=O)c1ccccc1
: