Target
Cysteine protease
Ligand
BDBM50322341
Substrate
Meas. Tech.
ChEMBL_642739 (CHEMBL1177219)
Ki
870±n/a nM
Citation
 Bova, FEttari, RMicale, NCarnovale, CSchirmeister, TGelhaus, CLeippe, MGrasso, SZappalà, M Constrained peptidomimetics as antiplasmodial falcipain-2 inhibitors. Bioorg Med Chem 18:4928-38 (2010)  
Target
Name:
Cysteine protease
Synonyms:
Rhodesain
Type:
PROTEIN
Mol. Mass.:
48425.78
Organism:
Trypanosoma brucei rhodesiense
Description:
ChEMBL_619861
Residue:
450
  
Inhibitor
Name:
BDBM50322341
Synonyms:
CHEMBL1171803 | Methyl4-(2-((R)-3-((4-chloro-2-(trifluoromethyl)phenylcarbamoyloxy)methyl-2-oxo-5-phenyl-2,3-dihydro-1H-benzo[e][1,4]diazepin-1-yl)acetamido)-6-methylhept-2-enoate
Type:
Small organic molecule
Emp. Form.:
C35H34ClF3N4O6
Mol. Mass.:
699.116
SMILES:
COC(=O)\C=C\[C@H](CC(C)C)NC(=O)CN1c2ccccc2C(=N[C@H](COC(=O)Nc2ccc(Cl)cc2C(F)(F)F)C1=O)c1ccccc1
: