Target
Translocator protein
Ligand
BDBM50335265
Substrate
Meas. Tech.
ChEMBL_702766 (CHEMBL1655209)
Ki
20.9±n/a nM
Citation
 Pike, VWTaliani, SLohith, TGOwen, DRPugliesi, IDa Pozzo, EHong, JZoghbi, SSGunn, RNParker, CARabiner, EAFujita, MInnis, RBMartini, CDa Settimo, F Evaluation of novel N1-methyl-2-phenylindol-3-ylglyoxylamides as a new chemotype of 18 kDa translocator protein-selective ligand suitable for the development of positron emission tomography radioligands. J Med Chem 54:366-73 (2011)  
Target
Name:
Translocator protein
Synonyms:
Benzodiazepine receptors; peripheral & central Mbr PBR Peripheral benzodiazepine receptor (PBR) TSPO_RAT | Tspo
Type:
Mitochondrion membrane protein
Mol. Mass.:
18945.84
Organism:
Rattus norvegicus (rat)
Description:
Competitive binding experiments were performed on rat kidney mitochondrial membranes.
Residue:
169
  
Inhibitor
Name:
BDBM50335265
Synonyms:
CHEMBL1651231 | N-benzyl-N-methyl-2-(1-methyl-2-phenyl-1H-indol-3-yl)-2-oxoacetamide
Type:
Small organic molecule
Emp. Form.:
C25H22N2O2
Mol. Mass.:
382.4544
SMILES:
CN(Cc1ccccc1)C(=O)C(=O)c1c(-c2ccccc2)n(C)c2ccccc12
: