Target
Translocator protein
Ligand
BDBM22038
Substrate
Meas. Tech.
ChEMBL_702767 (CHEMBL1655210)
Ki
0.37±n/a nM
Citation
 Pike, VWTaliani, SLohith, TGOwen, DRPugliesi, IDa Pozzo, EHong, JZoghbi, SSGunn, RNParker, CARabiner, EAFujita, MInnis, RBMartini, CDa Settimo, F Evaluation of novel N1-methyl-2-phenylindol-3-ylglyoxylamides as a new chemotype of 18 kDa translocator protein-selective ligand suitable for the development of positron emission tomography radioligands. J Med Chem 54:366-73 (2011)  
Target
Name:
Translocator protein
Synonyms:
Benzodiazepine receptors; peripheral & central Mbr PBR Peripheral benzodiazepine receptor (PBR) TSPO_RAT | Tspo
Type:
Mitochondrion membrane protein
Mol. Mass.:
18945.84
Organism:
Rattus norvegicus (rat)
Description:
Competitive binding experiments were performed on rat kidney mitochondrial membranes.
Residue:
169
  
Inhibitor
Name:
BDBM22038
Synonyms:
2-[2-(4-fluorophenyl)-1H-indol-3-yl]-N,N-dihexyl-2-oxoacetamide | CHEMBL53430
Type:
Small organic molecule
Emp. Form.:
C28H35FN2O2
Mol. Mass.:
450.5881
SMILES:
CCCCCCN(CCCCCC)C(=O)C(=O)c1c([nH]c2ccccc12)-c1ccc(F)cc1
: