Target
Translocator protein
Ligand
BDBM50335270
Substrate
Meas. Tech.
ChEMBL_702772 (CHEMBL1655215)
Ki
1.82±n/a nM
Citation
 Pike, VWTaliani, SLohith, TGOwen, DRPugliesi, IDa Pozzo, EHong, JZoghbi, SSGunn, RNParker, CARabiner, EAFujita, MInnis, RBMartini, CDa Settimo, F Evaluation of novel N1-methyl-2-phenylindol-3-ylglyoxylamides as a new chemotype of 18 kDa translocator protein-selective ligand suitable for the development of positron emission tomography radioligands. J Med Chem 54:366-73 (2011)  
Target
Name:
Translocator protein
Synonyms:
BZRP Mitochondrial benzodiazepine receptor PKBS Peripheral-type benzodiazepine receptor TSPO_HUMAN
Type:
Enzyme
Mol. Mass.:
18834.74
Organism:
Homo sapiens (Human)
Description:
P30536
Residue:
169
  
Inhibitor
Name:
BDBM50335270
Synonyms:
2-(1-methyl-2-(4-nitrophenyl)-1H-indol-3-yl)-2-oxo-N,N-dipropylacetamide | CHEMBL1651236
Type:
Small organic molecule
Emp. Form.:
C23H25N3O4
Mol. Mass.:
407.4623
SMILES:
CCCN(CCC)C(=O)C(=O)c1c(-c2ccc(cc2)[N+]([O-])=O)n(C)c2ccccc12
: