Target
Mitogen-activated protein kinase 7
Ligand
BDBM50337144
Substrate
Meas. Tech.
ChEMBL_719091 (CHEMBL1679302)
IC50
1240±n/a nM
Citation
 Deng, XYang, QKwiatkowski, NSim, TMcDermott, USettleman, JELee, JDGray, NS Discovery of a benzo[e]pyrimido-[5,4-b][1,4]diazepin-6(11H)-one as a Potent and Selective Inhibitor of Big MAP Kinase 1. ACS Med Chem Lett 2:195-200 (2011)  
Target
Name:
Mitogen-activated protein kinase 7
Synonyms:
BMK1 ERK5 MAPK7 PRKM7
Type:
Protein
Mol. Mass.:
88377.36
Organism:
Homo sapiens (Human)
Description:
Q13164
Residue:
816
  
Inhibitor
Name:
BDBM50337144
Synonyms:
8-chloro-2-((2-methoxy-4-(4-methylpiperazin-1-yl)phenyl)amino)-5,11-dimethyl-5H-benzo[e]pyrimido[5,4-b][1,4]diazepin-6(11H)-one | CHEMBL1673056
Type:
Small organic molecule
Emp. Form.:
C25H28ClN7O2
Mol. Mass.:
493.989
SMILES:
COc1cc(ccc1Nc1ncc2N(C)C(=O)c3cc(Cl)ccc3N(C)c2n1)N1CCN(C)CC1
: