Target
MAP kinase-activated protein kinase 2
Ligand
BDBM50380306
Substrate
Meas. Tech.
ChEMBL_813703 (CHEMBL2019905)
EC50
3000±n/a nM
Citation
 Huang, XShipps, GWCheng, CCSpacciapoli, PZhang, XMcCoy, MAWyss, DFYang, XAchab, ASoucy, KMontavon, DKMurphy, DMWhitehurst, CE Discovery and Hit-to-Lead Optimization of Non-ATP Competitive MK2 (MAPKAPK2) Inhibitors. ACS Med Chem Lett 2:632-637 (2011)  
Target
Name:
MAP kinase-activated protein kinase 2
Synonyms:
MAP kinase-activated protein kinase 2 (MAPKAPK2) MAP kinase-activated protein kinase 2 (p38/MK2) MAPK-activated protein kinase 2 MAPKAP kinase 2 MAPKAPK2 | MK2
Type:
Serine/threonine-protein kinase
Mol. Mass.:
45579.87
Organism:
Homo sapiens (Human)
Description:
P49137
Residue:
400
  
Inhibitor
Name:
BDBM50380306
Synonyms:
CHEMBL2017460
Type:
Small organic molecule
Emp. Form.:
C24H26ClN3O2
Mol. Mass.:
423.935
SMILES:
CCCN(C(=O)c1ccc(o1)-c1ccc(Cl)cc1)c1ccc(cc1)N1CCNCC1
: